BDBM50063281 (4-{2-[4-(2-Methoxy-phenyl)-piperazin-1-yl]-ethyl}-cyclohexyl)-pyrimidin-2-yl-amine::CHEMBL164792
SMILES COc1ccccc1N1CCN(CC[C@H]2CC[C@@H](CC2)Nc2ncccn2)CC1
InChI Key InChIKey=HWSOAPGUROKPOX-MXVIHJGJSA-N
Data  3 KI  1 IC50
  Tab Delimited (TSV)   2D SDfile   Computed 3D by Vconf -m prep SDfile
Find this compound or compounds like it in BindingDB:
Activity Spreadsheet -- Enzyme Inhibition Constant Data from BindingDB
Found 2 hits for monomerid = 50063281
TargetD(2) dopamine receptor(Homo sapiens (Human))
Warner-Lambert
Curated by ChEMBL
LigandPNGBDBM50063281((4-{2-[4-(2-Methoxy-phenyl)-piperazin-1-yl]-ethyl}...)
Affinity DataKi:  3nM. Assay description: Binding affinity determined by measuring its ability to displace [3H]-N-0437 radioligand in CHO-K1 cells on Cloned Human Dopamine receptor D2
In DepthDetails ArticlePubMed
TargetD(2) dopamine receptor(Homo sapiens (Human))
Warner-Lambert
Curated by ChEMBL
LigandPNGBDBM50063281((4-{2-[4-(2-Methoxy-phenyl)-piperazin-1-yl]-ethyl}...)
Affinity DataIC50:  9.90nM. Assay description: The in vitro intrinsic activity was measured at DA D2 receptor by measuring its ability to increase [3H]-thymidine uptake in CHO-K1 cells transfected...
In DepthDetails ArticlePubMed